{"text_format":"1","workbook":"xlsx","n_sheets":16,"sheets":["LANDING","Overview","Context","HOW TO USE","1. BUY-IN","2. INTERNAL RELATIONSHIPS, COLL","3. EXTERNAL RELATIONSHIPS","4. INFO SHARING AND GOVERNANCE","5. EQUITY AND EQUALITY","6. PERSON-CENTRED PRACTICE","7. RESOURCES-HUMAN AND FINANCE","8. EMBEDDING DATA IN PRACTICE","Data Validation","Current_Summary","PDF_Layout","Comparison"],"not_rendered":{"charts":25,"images":9,"macros":1,"external_links":0,"defined_names":1,"comments":0,"pivot_tables":0},"unopened":[],"bounds":{"document_bytes":16777216,"sheet_cells":100000,"rows_first":2000,"rows_last":500,"rows_between":2000,"halvings":0,"cell_chars":16384,"cell_head_chars":4096},"cells_cut":0,"cells_raw":0,"read":"whole","date_system":"1900"}

{"sheet":"LANDING","index":0,"n_rows":26,"n_cols":13,"rows_kept":26,"cut":false,"hidden":false,"merged":[[24,8,24,13]]}
[]
[]
[]
[]
[]
[]
{"$rows_left_out":21}
{"sheet":"Overview","index":1,"n_rows":3,"n_cols":1,"rows_kept":3,"cut":false,"hidden":false,"merged":[]}
["PURPOSE OF THE MATRIX"]
[]
["Click here: MULTI-PROFESSIONAL FRAMEWORK RESOURCES"]

{"sheet":"Context","index":2,"n_rows":11,"n_cols":3,"rows_kept":11,"cut":false,"hidden":false,"merged":[[0,0,0,2],[1,0,1,2],[2,0,2,1],[2,2,3,2]]}
["PURPOSE OF THE MATRIX"]
["There is an important connection to be drawn between this DM and the fundamental principles of the Workforce Strategy for Health and Social Care. The strategy is underpinned by seven key themes which have been shaped by the engagement and consultation undertaken by Social Care Wales and Health Education and Improvement Wales. What we have provided here is a cross reference between those themes and this DM, to demonstrate and ensure there is alignment – the link to the relevant Domain and Indicator within this matrix is provided in the table below:"]
["Key components from the Workforce Strategy for Health and Social Care",null,"Links to Domains within this DM"]
["THEME","DESCRIPTOR"]
["1. An Engaged, Motivated and Healthy Workforce","By 2030, the health and social care workforce will feel valued, fairly rewarded and supported wherever they work","2, 6, 7, 8"]
["2. Attraction and Recruitment","By 2030, health and social care will be well established as a strong and recognisable brand and the sector of choice for our future workforce","7, 8"]
{"$rows_left_out":6}
{"sheet":"HOW TO USE","index":3,"n_rows":1,"n_cols":1,"rows_kept":1,"cut":false,"hidden":false,"merged":[]}
["HOW TO USE THE MATRIX"]

{"sheet":"1. BUY-IN","index":4,"n_rows":17,"n_cols":9,"rows_kept":17,"cut":false,"hidden":false,"merged":[[0,0,3,0],[5,0,5,6],[2,1,2,3],[0,1,0,5],[1,1,1,5],[2,4,2,5],[4,0,4,8],[3,7,3,8],[14,0,16,0],[11,0,13,0],[11,1,11,8],[12,1,12,8],[14,1,14,8],[13,1,13,8],[15,1,15,8],[16,1,16,8]]}
["Domain ","Descriptors: For each of the dimensions below, which statement below (S1-S5) best describes your current position? "]
[null,"It is important to note that there is an underlying logic in how the statements build on one another across the matrix. The statements are broadly incremental – moving along the boxes presupposes that forms of practice under the previous statement are included in the next one. "]
[null,"Darker shading against statements indicates that there is evidence that the statement has been fully achieved. ",null,null,"Lighter shading is an indication that some progress has been made in this domain, but that it remains a ‘work in progress’. "]
[null,"S1 ","S2 ","S3 ","S4 ","S5 ","N/A "]
["1. BUY-IN "]
["Most important & impactful data items: one system that supports people by putting them at the centre; agreed processes that enable seamless delivery between teams and services; co-ordinated service provision; strong leadership ",null,null,null,null,null,null,"LEVEL OF STATEMENT","Additional Comments"]
{"$rows_left_out":12}
{"sheet":"2. INTERNAL RELATIONSHIPS, COLL","index":5,"n_rows":17,"n_cols":9,"rows_kept":17,"cut":false,"hidden":false,"merged":[[0,7,2,8],[3,7,3,8],[4,7,4,8],[0,0,3,0],[4,0,4,6],[5,0,5,6],[2,1,2,3],[0,1,0,5],[1,1,1,5],[2,4,2,5],[15,0,16,0],[13,0,14,0],[13,1,13,7],[14,1,14,7],[15,1,15,7],[16,1,16,7]]}
["Domain ","Descriptors: For each of the dimensions below, which statement below (S1-S5) best describes your current position? "]
[null,"It is important to note that there is an underlying logic in how the statements build on one another across the matrix. The statements are broadly incremental – moving along the boxes presupposes that forms of practice under the previous statement are included in the next one. "]
[null,"Darker shading against statements indicates that there is evidence that the statement has been fully achieved. ",null,null,"Lighter shading is an indication that some progress has been made in this domain, but that it remains a ‘work in progress’. "]
[null,"S1 ","S2 ","S3 ","S4 ","S5 ","N/A "]
["2. INTERNAL RELATIONSHIPS, COLLABORATION AND COHESION "]
["Most important & impactful data items: supportive team climate; positive leadership; respect for others; shared vision; delivery of safe, high quality, effective care ",null,null,null,null,null,null,"LEVEL OF STATEMENT","Additional Comments"]
{"$rows_left_out":12}
{"sheet":"3. EXTERNAL RELATIONSHIPS","index":6,"n_rows":18,"n_cols":9,"rows_kept":18,"cut":false,"hidden":false,"merged":[[0,7,2,8],[3,7,3,8],[2,1,2,3],[0,0,3,0],[0,1,0,5],[1,1,1,5],[2,4,2,5],[15,0,17,0],[4,0,4,6],[5,0,5,6],[12,0,14,0],[12,1,12,7],[13,1,13,7],[14,1,14,7],[15,1,15,7],[16,1,16,7],[17,1,17,7]]}
["Domain ","Descriptors: For each of the dimensions below, which statement below (S1-S5) best describes your current position? "]
[null,"It is important to note that there is an underlying logic in how the statements build on one another across the matrix. The statements are broadly incremental – moving along the boxes presupposes that forms of practice under the previous statement are included in the next one. "]
[null,"Darker shading against statements indicates that there is evidence that the statement has been fully achieved. ",null,null,"Lighter shading is an indication that some progress has been made in this domain, but that it remains a ‘work in progress’. "]
[null,"S1 ","S2 ","S3 ","S4 ","S5 ","N/A "]
["3. EXTERNAL RELATIONSHIPS "]
["Most important & impactful data items: co-ordinated service provision; reduced risk of harm; the right person providing the right support at the right time; delivery of safe, high quality, effective care; trust and relationships between organisations ",null,null,null,null,null,null,"LEVEL OF STATEMENT","Additional Comments"]
{"$rows_left_out":13}
{"sheet":"4. INFO SHARING AND GOVERNANCE","index":7,"n_rows":20,"n_cols":9,"rows_kept":20,"cut":false,"hidden":false,"merged":[[4,7,4,8],[3,7,3,8],[0,7,2,8],[17,0,19,0],[13,0,16,0],[0,0,3,0],[4,0,4,6],[5,0,5,6],[2,1,2,3],[0,1,0,5],[1,1,1,5],[2,4,2,5],[13,1,13,7],[14,1,14,7],[15,1,15,7],[16,1,16,7],[17,1,17,7],[18,1,18,7],[19,1,19,7]]}
["Domain ","Descriptors: For each of the dimensions below, which statement below (S1-S5) best describes your current position? "]
[null,"It is important to note that there is an underlying logic in how the statements build on one another across the matrix. The statements are broadly incremental – moving along the boxes presupposes that forms of practice under the previous statement are included in the next one. "]
[null,"Darker shading  against statements indicates that there is evidence that the statement has been fully achieved. ",null,null,"Lighter shading is an indication that some progress has been made in this domain, but that it remains a ‘work in progress’. "]
[null,"S1 ","S2 ","S3 ","S4 ","S5 ","N/A "]
["4. INFORMATION SHARING AND GOVERNANCE "]
["Most important & impactful data items: using shared IT systems, agreed processes that enable seamless delivery between teams and services; one system that supports people by putting them at the centre ",null,null,null,null,null,null,"LEVEL OF STATEMENT","Additional Comments"]
{"$rows_left_out":15}
{"sheet":"5. EQUITY AND EQUALITY","index":8,"n_rows":17,"n_cols":9,"rows_kept":17,"cut":false,"hidden":false,"merged":[[0,7,2,8],[3,7,3,8],[4,7,4,8],[0,0,3,0],[4,0,4,6],[5,0,5,6],[2,1,2,3],[0,1,0,5],[1,1,1,5],[2,4,2,5],[13,0,16,0],[10,0,12,0],[10,1,10,7],[11,1,11,7],[12,1,12,7],[13,1,13,7],[14,1,14,7],[15,1,15,7],[16,1,16,7]]}
["Domain ","Descriptors: For each of the dimensions below, which statement below (S1-S5) best describes your current position? "]
[null,"It is important to note that there is an underlying logic in how the statements build on one another across the matrix. The statements are broadly incremental – moving along the boxes presupposes that forms of practice under the previous statement are included in the next one. "]
[null,"Darker shading  against statements indicates that there is evidence that the statement has been fully achieved. ",null,null,"Lighter shading is an indication that some progress has been made in this domain, but that it remains a ‘work in progress’. "]
[null,"S1 ","S2 ","S3 ","S4 ","S5 ","N/A "]
["5. EQUITY AND EQUALITY "]
["Most important & impactful data items: respect for others, supportive team climate, valuing the peoples voice; the right person providing the right support at the right time; a happy workforce having a positive impact on patient outcomes ",null,null,null,null,null,null,"LEVEL OF STATEMENT","Additional Comments"]
{"$rows_left_out":12}
{"sheet":"6. PERSON-CENTRED PRACTICE","index":9,"n_rows":19,"n_cols":9,"rows_kept":19,"cut":false,"hidden":false,"merged":[[4,7,4,8],[3,7,3,8],[0,7,2,8],[0,0,3,0],[4,0,4,6],[5,0,5,6],[2,1,2,3],[0,1,0,5],[1,1,1,5],[2,4,2,5],[16,0,18,0],[12,0,15,0],[12,1,12,7],[13,1,13,7],[14,1,14,7],[15,1,15,7],[16,1,16,7],[17,1,17,7],[18,1,18,7]]}
["Domain ","Descriptors: For each of the dimensions below, which statement below (S1-S5) best describes your current position? "]
[null,"It is important to note that there is an underlying logic in how the statements build on one another across the matrix. The statements are broadly incremental – moving along the boxes presupposes that forms of practice under the previous statement are included in the next one. "]
[null,"Darker shading  against statements indicates that there is evidence that the statement has been fully achieved. ",null,null,"Lighter shading is an indication that some progress has been made in this domain, but that it remains a ‘work in progress’. "]
[null,"S1 ","S2 ","S3 ","S4 ","S5 ","N/A "]
["6. PERSON-CENTRED PRACTICE "]
["Most important & impactful data items: person receiving timely, coordinated, collaborative care; maximising peoples independence; enabling people to have involvement in their care; supporting people to live well; shared decision making with the person; better care and clarity for people and their families; person receiving care in a location and format that best meets their needs; accessible support and care; wanting to do right by the person; measuring service user perspective; more focus on early intervention ",null,null,null,null,null,null,"LEVEL OF STATEMENT ","Additional Comments"]
{"$rows_left_out":14}
{"sheet":"7. RESOURCES-HUMAN AND FINANCE","index":10,"n_rows":19,"n_cols":9,"rows_kept":19,"cut":false,"hidden":false,"merged":[[0,7,2,8],[3,7,3,8],[4,7,4,8],[0,0,3,0],[4,0,4,6],[16,0,18,0],[14,0,15,0],[0,1,0,5],[1,1,1,5],[2,1,2,3],[2,4,2,5],[5,0,5,6],[14,1,14,7],[15,1,15,7],[16,1,16,7],[17,1,17,7],[18,1,18,7]]}
["Domain ","Descriptors: For each of the dimensions below, which statement below (S1-S5) best describes your current position? "]
[null,"It is important to note that there is an underlying logic in how the statements build on one another across the matrix. The statements are broadly incremental – moving along the boxes presupposes that forms of practice under the previous statement are included in the next one. "]
[null,"Darker shading  against statements indicates that there is evidence that the statement has been fully achieved. ",null,null,"Lighter shading is an indication that some progress has been made in this domain, but that it remains a ‘work in progress’. "]
[null,"S1 ","S2 ","S3 ","S4 ","S5 ","N/A "]
["7. RESOURCES – HUMAN AND FINANCIAL "]
["Most important & impactful data items: staff wellbeing; staff satisfaction; a happy workforce having a positive impact on patient outcomes; staff retention; empowering staff to work more effectively  ",null,null,null,null,null,null,"LEVEL OF STATEMENT","Additional Comments"]
{"$rows_left_out":14}
{"sheet":"8. EMBEDDING DATA IN PRACTICE","index":11,"n_rows":18,"n_cols":9,"rows_kept":18,"cut":false,"hidden":false,"merged":[[4,7,4,8],[3,7,3,8],[0,7,2,8],[0,1,0,5],[1,1,1,5],[5,0,5,6],[4,0,4,6],[2,1,2,3],[2,4,2,5],[0,0,3,0],[15,0,17,0],[13,0,14,0],[13,1,13,7],[14,1,14,7],[15,1,15,7],[16,1,16,7],[17,1,17,7]]}
["Domain ","Descriptors: For each of the dimensions below, which statement below (S1-S5) best describes your current position? "]
[null,"It is important to note that there is an underlying logic in how the statements build on one another across the matrix. The statements are broadly incremental – moving along the boxes presupposes that forms of practice under the previous statement are included in the next one. "]
[null,"Darker shading  against statements indicates that there is evidence that the statement has been fully achieved. ",null,null,"Lighter shading is an indication that some progress has been made in this domain, but that it remains a ‘work in progress’. "]
[null,"S1 ","S2 ","S3 ","S4 ","S5 ","N/A "]
["8. EMBEDDING DATA IN PRACTICE "]
["Most important & impactful data items: measuring service user perspective; delivery of safe, high quality, effective care; valuing the peoples voice; trust and relationships between organisations; using shared IT systems; reduced risk of harm ",null,null,null,null,null,null,"LEVEL OF STATEMENT","Additional Comments"]
{"$rows_left_out":13}
{"sheet":"Data Validation","index":12,"n_rows":7,"n_cols":1,"rows_kept":7,"cut":false,"hidden":true,"merged":[]}
["Score"]
[1]
[2]
[3]
[4]
[5]
{"$rows_left_out":2}
{"sheet":"Current_Summary","index":13,"n_rows":45,"n_cols":17,"rows_kept":45,"cut":false,"hidden":false,"merged":[[32,0,38,0],[32,1,32,7],[33,1,33,7],[34,1,34,7],[35,1,35,7],[36,1,36,7],[37,1,37,7],[38,1,38,7],[39,0,44,0],[39,1,39,7],[40,1,40,7],[41,1,41,7],[42,1,42,7],[43,1,43,7],[44,1,44,7],[24,0,26,0],[24,1,24,7],[25,1,25,7],[26,1,26,7],[27,0,31,0],[27,1,27,7],[28,1,28,7],[29,1,29,7],[30,1,30,7],[31,1,31,7],[18,0,23,0],[18,1,18,7],[19,1,19,7],[20,1,20,7],[21,1,21,7],[22,1,22,7],[23,1,23,7],[13,0,17,0],[13,1,13,7],[14,1,14,7],[15,1,15,7],[16,1,16,7],[17,1,17,7],[1,0,1,21],[7,0,12,0],[7,1,7,7],[8,1,8,7],[9,1,9,7],[10,1,10,7],[11,1,11,7],[12,1,12,7],[2,1,2,7],[2,14,2,15],[3,0,6,0],[3,1,3,7],[4,1,4,7],[5,1,5,7],[6,1,6,7]]}
[null,null,null,null,null,null,null,null,1,2,3,4,5,"NA"]
["CURRENT SUMMARY"]
["Domain","Statement",null,null,null,null,null,null,"S1","S2","S3","S4","S5","N/A","Selected Level",null,"Comments "]
["1. Buy In","1.1 | Connections with the patients and the wider public",null,null,null,null,null,null,{"$f":"IF(I$1=$P4,$P4,\"\")","v":""},{"$f":"IF(J$1=$P4,$P4,\"\")","v":""},"","","","",{"$f":"_xlfn.IFS($I4=$I$1,'1. BUY-IN'!$B7,$J4=J$1,'1. BUY-IN'!$C7,$K4=K$1,'1. BUY-IN'!$D7,$L4=L$1,'1. BUY-IN'!$E7,$M4=M$1,'1. BUY-IN'!$F7)","v":{"$error":"#N/A"}},{"$f":"'1. BUY-IN'!H7","v":0},{"$f":"IF('1. BUY-IN'!I7=\"\",\"\",'1. BUY-IN'!I7)","v":""}]
[null,"1.2 | Strategic and senior leader engagement",null,null,null,null,null,null,{"$f":"IF(I$1=$P5,$P5,\"\")","v":""},"","","","","",{"$f":"_xlfn.IFS($I5=$I$1,'1. BUY-IN'!$B8,$J5=J$1,'1. BUY-IN'!$C8,$K5=K$1,'1. BUY-IN'!$D8,$L5=L$1,'1. BUY-IN'!$E8,$M5=M$1,'1. BUY-IN'!$F8)","v":{"$error":"#N/A"}},{"$f":"'1. BUY-IN'!H8","v":0},{"$f":"IF('1. BUY-IN'!I8=\"\",\"\",'1. BUY-IN'!I8)","v":""}]
[null,"1.3 | Influence within key organisations (health board and/or local authority and/or third sector) processes",null,null,null,null,null,null,"","","","","","",{"$f":"_xlfn.IFS($I6=$I$1,'1. BUY-IN'!$B9,$J6=J$1,'1. BUY-IN'!$C9,$K6=K$1,'1. BUY-IN'!$D9,$L6=L$1,'1. BUY-IN'!$E9,$M6=M$1,'1. BUY-IN'!$F9)","v":{"$error":"#N/A"}},{"$f":"'1. BUY-IN'!H9","v":0},{"$f":"IF('1. BUY-IN'!I9=\"\",\"\",'1. BUY-IN'!I9)","v":""}]
{"$rows_left_out":40}
{"sheet":"PDF_Layout","index":14,"n_rows":65,"n_cols":17,"rows_kept":65,"cut":false,"hidden":false,"merged":[[1,0,1,16],[2,1,2,7],[2,14,2,15],[3,0,6,0],[3,1,3,7],[4,1,4,7],[5,1,5,7],[6,1,6,7],[10,0,15,0],[10,1,10,7],[11,1,11,7],[12,1,12,7],[13,1,13,7],[14,1,14,7],[15,1,15,7],[19,0,23,0],[19,1,19,7],[20,1,20,7],[21,1,21,7],[22,1,22,7],[23,1,23,7],[27,0,32,0],[27,1,27,7],[28,1,28,7],[29,1,29,7],[30,1,30,7],[31,1,31,7],[32,1,32,7],[36,0,38,0],[36,1,36,7],[37,1,37,7],[38,1,38,7],[42,0,46,0],[42,1,42,7],[43,1,43,7],[44,1,44,7],[45,1,45,7],[46,1,46,7],[50,0,56,0],[50,1,50,7],[51,1,51,7],[52,1,52,7],[53,1,53,7],[54,1,54,7],[55,1,55,7],[56,1,56,7],[59,0,64,0],[59,1,59,7],[60,1,60,7],[61,1,61,7],[62,1,62,7],[63,1,63,7],[64,1,64,7],[9,1,9,7],[9,14,9,15],[18,14,18,15],[26,1,26,7],[26,14,26,15],[18,1,18,7],[58,1,58,7],[58,14,58,15],[35,1,35,7],[35,14,35,15],[41,1,41,7],[41,14,41,15],[49,1,49,7],[49,14,49,15]]}
[null,null,null,null,null,null,null,null,1,2,3,4,5,"NA"]
["CURRENT SUMMARY"]
["Domain","Statement",null,null,null,null,null,null,"S1","S2","S3","S4","S5","N/A","Selected Level",null,"Comments "]
["1. Buy In","1.1 | Connections with the patients and the wider public",null,null,null,null,null,null,{"$f":"IF(I$1=$P4,$P4,\"\")","v":""},{"$f":"IF(J$1=$P4,$P4,\"\")","v":""},"","","","",{"$f":"_xlfn.IFS($I4=$I$1,'1. BUY-IN'!$B7,$J4=J$1,'1. BUY-IN'!$C7,$K4=K$1,'1. BUY-IN'!$D7,$L4=L$1,'1. BUY-IN'!$E7,$M4=M$1,'1. BUY-IN'!$F7)","v":{"$error":"#N/A"}},{"$f":"'1. BUY-IN'!H7","v":0},{"$f":"IF('1. BUY-IN'!I7=\"\",\"\",'1. BUY-IN'!I7)","v":""}]
[null,"1.2 | Strategic and senior leader engagement",null,null,null,null,null,null,{"$f":"IF(I$1=$P5,$P5,\"\")","v":""},"","","","","",{"$f":"_xlfn.IFS($I5=$I$1,'1. BUY-IN'!$B8,$J5=J$1,'1. BUY-IN'!$C8,$K5=K$1,'1. BUY-IN'!$D8,$L5=L$1,'1. BUY-IN'!$E8,$M5=M$1,'1. BUY-IN'!$F8)","v":{"$error":"#N/A"}},{"$f":"'1. BUY-IN'!H8","v":0},{"$f":"IF('1. BUY-IN'!I8=\"\",\"\",'1. BUY-IN'!I8)","v":""}]
[null,"1.3 | Influence within key organisations (health board and/or local authority and/or third sector) processes",null,null,null,null,null,null,"","","","","","",{"$f":"_xlfn.IFS($I6=$I$1,'1. BUY-IN'!$B9,$J6=J$1,'1. BUY-IN'!$C9,$K6=K$1,'1. BUY-IN'!$D9,$L6=L$1,'1. BUY-IN'!$E9,$M6=M$1,'1. BUY-IN'!$F9)","v":{"$error":"#N/A"}},{"$f":"'1. BUY-IN'!H9","v":0},{"$f":"IF('1. BUY-IN'!I9=\"\",\"\",'1. BUY-IN'!I9)","v":""}]
{"$rows_left_out":60}
{"sheet":"Comparison","index":15,"n_rows":45,"n_cols":7,"rows_kept":45,"cut":false,"hidden":false,"merged":[[34,1,34,7],[35,1,35,7],[36,1,36,7],[37,1,37,7],[38,1,38,7],[39,0,44,0],[39,1,39,7],[44,1,44,7],[24,0,26,0],[24,1,24,7],[25,1,25,7],[26,1,26,7],[27,0,31,0],[27,1,27,7],[28,1,28,7],[29,1,29,7],[30,1,30,7],[31,1,31,7],[32,0,38,0],[32,1,32,7],[33,1,33,7],[18,0,23,0],[18,1,18,7],[19,1,19,7],[20,1,20,7],[21,1,21,7],[22,1,22,7],[23,1,23,7],[13,0,17,0],[13,1,13,7],[14,1,14,7],[15,1,15,7],[16,1,16,7],[17,1,17,7],[7,0,12,0],[7,1,7,7],[8,1,8,7],[9,1,9,7],[10,1,10,7],[11,1,11,7],[12,1,12,7],[2,1,2,7],[3,0,6,0],[3,1,3,7],[4,1,4,7],[5,1,5,7],[6,1,6,7]]}
[null,null,null,null,null,null,"COMPARISON"]
[]
["Domain","Level of statement"]
["1. Buy In","1.1 | Connections with the patients and the wider public"]
[null,"1.2 | Strategic and senior leader engagement"]
[null,"1.3 | Influence within key organisations (health board and/or local authority and/or third sector) processes"]
{"$rows_left_out":39}